Migration error

I migrated my Open edX according to the document, but it didn’t work normally after I ran tutoe lcoal start -d. this is my error message. I hope you can give me some help, thank you

110.2 ERROR in ./src/id-verification/assets/example-card.png
#0 110.2 Module build failed (from ./node_modules/image-webpack-loader/index.js):
#0 110.2 Error: Cannot find module 'mozjpeg'
#0 110.2 Require stack:
#0 110.2 - /openedx/app/node_modules/imagemin-mozjpeg/index.js
#0 110.2 - /openedx/app/node_modules/image-webpack-loader/index.js
#0 110.2 - /openedx/app/node_modules/loader-runner/lib/loadLoader.js
#0 110.2 - /openedx/app/node_modules/loader-runner/lib/LoaderRunner.js
#0 110.2 - /openedx/app/node_modules/webpack/lib/NormalModuleFactory.js
#0 110.2 - /openedx/app/node_modules/webpack/lib/Compiler.js
#0 110.2 - /openedx/app/node_modules/webpack/lib/webpack.js
#0 110.2 - /openedx/app/node_modules/webpack/lib/index.js
#0 110.2 - /openedx/app/node_modules/webpack-cli/lib/webpack-cli.js
#0 110.2 - /openedx/app/node_modules/webpack-cli/lib/bootstrap.js
#0 110.2 - /openedx/app/node_modules/webpack-cli/bin/cli.js
#0 110.2 - /openedx/app/node_modules/webpack/bin/webpack.js
#0 110.2 - /openedx/app/node_modules/@edx/frontend-build/bin/fedx-scripts.js
#0 110.2     at Function.Module._resolveFilename (internal/modules/cjs/loader.js:815:15)
#0 110.2     at Function.Module._load (internal/modules/cjs/loader.js:667:27)
#0 110.2     at Module.require (internal/modules/cjs/loader.js:887:19)
#0 110.2     at require (internal/modules/cjs/helpers.js:74:18)
#0 110.2     at Object.<anonymous> (/openedx/app/node_modules/imagemin-mozjpeg/index.js:4:17)
#0 110.2     at Module._compile (internal/modules/cjs/loader.js:999:30)
#0 110.2     at Object.Module._extensions..js (internal/modules/cjs/loader.js:1027:10)
#0 110.2     at Module.load (internal/modules/cjs/loader.js:863:32)
#0 110.2     at Function.Module._load (internal/modules/cjs/loader.js:708:14)
#0 110.2     at Module.require (internal/modules/cjs/loader.js:887:19)
#0 110.2  @ ./src/id-verification/panels/ReviewRequirementsPanel.jsx 11:0-53 110:17-28
#0 110.2  @ ./src/id-verification/IdVerificationPage.jsx 24:0-71 79:29-52
#0 110.2  @ ./src/id-verification/index.js 1:0-47 1:0-47
#0 110.2  @ ./src/index.jsx 13:0-51 36:25-43
#0 110.2 
#0 110.2 webpack 5.50.0 compiled with 1 error and 1 warning in 103449 ms
#0 110.4 npm ERR! code ELIFECYCLE
#0 110.4 npm ERR! errno 1
#0 110.4 npm ERR! @edx/frontend-app-account@1.0.0-semantically-released build: `fedx-scripts webpack`
#0 110.4 npm ERR! Exit status 1
#0 110.4 npm ERR! 
#0 110.4 npm ERR! Failed at the @edx/frontend-app-account@1.0.0-semantically-released build script.
#0 110.4 npm ERR! This is probably not a problem with npm. There is likely additional logging output above.
#0 110.4 
#0 110.4 npm ERR! A complete log of this run can be found in:
#0 110.4 npm ERR!     /root/.npm/_logs/2022-07-14T09_10_05_823Z-debug.log
------
failed to solve: executor failed running [/bin/sh -c bash -c "set -a && source /openedx/env/production && source /openedx/env/production.override && npm run build"]: exit code: 1
Error: Command failed with status 17: docker-compose -f /home/julien/.local/share/tutor/env/local/docker-compose.yml -f /home/julien/.local/share/tutor/env/local/docker-compose.prod.yml -f /home/julien/.local/share/tutor/env/local/docker-compose.tmp.yml --project-name tutor_local up --remove-orphans --build -d

This is my runtime memory information